=> "/opt/pkg/bin/bmake" ["-C", "/Volumes/data/jenkins/workspace/pkgsrc-macos-trunk-arm64/chat/bitlbee-mastodon", "all", "BATCH=1", "DEPENDS_TARGET=/nonexistent"] ===> Building for bitlbee-mastodon-1.4.5nb5 /opt/pkg/bin/gmake all-recursive gmake[1]: Entering directory '/var/tmp/work/chat/bitlbee-mastodon/work/bitlbee-mastodon-1.4.5' Making all in src gmake[2]: Entering directory '/var/tmp/work/chat/bitlbee-mastodon/work/bitlbee-mastodon-1.4.5/src' CC mastodon_la-mastodon.lo CC mastodon_la-mastodon-http.lo CC mastodon_la-mastodon-lib.lo CC mastodon_la-rot13.lo mastodon-lib.c:2096:28: error: cannot combine with previous 'int' declaration specifier 2096 | static char *yes_or_no(int bool) | ^ mastodon-lib.c:2098:9: error: expected expression 2098 | return bool ? "yes" : "no"; | ^ 2 errors generated. gmake[2]: *** [Makefile:505: mastodon_la-mastodon-lib.lo] Error 1 gmake[2]: *** Waiting for unfinished jobs.... gmake[2]: Leaving directory '/var/tmp/work/chat/bitlbee-mastodon/work/bitlbee-mastodon-1.4.5/src' gmake[1]: *** [Makefile:445: all-recursive] Error 1 gmake[1]: Leaving directory '/var/tmp/work/chat/bitlbee-mastodon/work/bitlbee-mastodon-1.4.5' gmake: *** [Makefile:377: all] Error 2 *** Error code 2 Stop. bmake[1]: stopped making "all" in /Volumes/data/jenkins/workspace/pkgsrc-macos-trunk-arm64/chat/bitlbee-mastodon *** Error code 1 Stop. bmake: stopped making "all" in /Volumes/data/jenkins/workspace/pkgsrc-macos-trunk-arm64/chat/bitlbee-mastodon