=> "/opt/pkg/bin/bmake" ["-C", "/Volumes/data/jenkins/workspace/pkgsrc-macos-trunk-arm64/mail/cyrus-imapd310", "all", "BATCH=1", "DEPENDS_TARGET=/nonexistent"] ===> Building for cyrus-imapd-3.10.2nb2 GEN lib/imapopts.c CC com_err/et/libcyrus_com_err_la-com_err.lo com_err/et/com_err.c:136:13: error: unknown type name 'whoami' 136 | com_err_va (whoami, code, fmt, args) | ^ com_err/et/com_err.c:136:21: error: unknown type name 'code' 136 | com_err_va (whoami, code, fmt, args) | ^ com_err/et/com_err.c:136:27: error: unknown type name 'fmt' 136 | com_err_va (whoami, code, fmt, args) | ^ com_err/et/com_err.c:136:32: error: unknown type name 'args' 136 | com_err_va (whoami, code, fmt, args) | ^ com_err/et/com_err.c:135:16: error: format argument not a string type 135 | __attribute__((format(printf, 3, 0))) | ^ ~ com_err/et/com_err.c:136:37: error: expected ';' after top level declarator 136 | com_err_va (whoami, code, fmt, args) | ^ | ; com_err/et/com_err.c:141:1: error: expected identifier or '(' 141 | { | ^ com_err/et/com_err.c:175:24: error: unknown type name 'new_proc' 175 | errf set_com_err_hook (new_proc) | ^ com_err/et/com_err.c:175:33: error: expected ';' after top level declarator 175 | errf set_com_err_hook (new_proc) | ^ | ; com_err/et/com_err.c:177:1: error: expected identifier or '(' 177 | { | ^ 10 errors generated. gmake: *** [Makefile:5608: com_err/et/libcyrus_com_err_la-com_err.lo] Error 1 *** Error code 2 Stop. bmake[1]: stopped making "all" in /Volumes/data/jenkins/workspace/pkgsrc-macos-trunk-arm64/mail/cyrus-imapd310 *** Error code 1 Stop. bmake: stopped making "all" in /Volumes/data/jenkins/workspace/pkgsrc-macos-trunk-arm64/mail/cyrus-imapd310