=> "/opt/pkg/bin/bmake" ["-C", "/Volumes/data/jenkins/workspace/pkgsrc-macos-trunk-arm64/games/liblcf", "all", "BATCH=1", "DEPENDS_TARGET=/nonexistent"] ===> Building for liblcf-0.7.0nb10 CXX tools/lcf2xml-lcf2xml.o CXX tools/lcfstrings-lcfstrings.o CXX src/liblcf_la-dbarray.lo In file included from tools/lcfstrings.cpp:12: In file included from ./src/lcf/ldb/reader.h:16: In file included from ./src/generated/lcf/rpg/database.h:27: In file included from ./src/generated/lcf/rpg/item.h:18: ./src/lcf/dbbitarray.h:95:30: error: no member named '_base' in 'DBBitProxyIterator

' 95 | std::swap(_proxy._base, o._base); | ~ ^ ./src/lcf/dbbitarray.h:96:29: error: no member named '_idx' in 'DBBitProxyIterator

' 96 | std::swap(_proxy._idx, o._idx); | ~ ^ In file included from tools/lcf2xml.cpp:14: In file included from ./src/lcf/ldb/reader.h:16: In file included from ./src/generated/lcf/rpg/database.h:27: In file included from ./src/generated/lcf/rpg/item.h:18: ./src/lcf/dbbitarray.h:95:30: error: no member named '_base' in 'DBBitProxyIterator

' 95 | std::swap(_proxy._base, o._base); | ~ ^ ./src/lcf/dbbitarray.h:96:29: error: no member named '_idx' in 'DBBitProxyIterator

' 96 | std::swap(_proxy._idx, o._idx); | ~ ^ 2 errors generated. gmake: *** [Makefile:2928: tools/lcfstrings-lcfstrings.o] Error 1 gmake: *** Waiting for unfinished jobs.... 2 errors generated. gmake: *** [Makefile:2914: tools/lcf2xml-lcf2xml.o] Error 1 *** Error code 2 Stop. bmake[1]: stopped making "all" in /Volumes/data/jenkins/workspace/pkgsrc-macos-trunk-arm64/games/liblcf *** Error code 1 Stop. bmake: stopped making "all" in /Volumes/data/jenkins/workspace/pkgsrc-macos-trunk-arm64/games/liblcf