=> "/opt/pkg/bin/bmake" ["-C", "/Volumes/data/jenkins/workspace/pkgsrc-macos-trunk-arm64/audio/zam-plugins", "all", "BATCH=1", "DEPENDS_TARGET=/nonexistent"] ===> Building for zam-plugins-3.14nb4 /opt/pkg/bin/gmake -C dpf/dgl /opt/pkg/bin/gmake -C dpf/utils/lv2-ttl-generator gmake[1]: Entering directory '/var/tmp/work/audio/zam-plugins/work/zam-plugins-3.14/dpf/dgl' gmake[1]: Entering directory '/var/tmp/work/audio/zam-plugins/work/zam-plugins-3.14/dpf/utils/lv2-ttl-generator' clang lv2_ttl_generator.c -pipe -Os -I/opt/pkg/include -I/opt/pkg/include/ncurses -o ../lv2_ttl_generator -L/opt/pkg/lib Compiling src/Application.cpp clang++: error: unsupported option '-mfpu=' for target 'arm64-apple-darwin27.0.0' clang++: error: unsupported option '-mfloat-abi=' for target 'arm64-apple-darwin27.0.0' gmake[1]: *** [Makefile:104: ../build/dgl/Application.cpp.o] Error 1 gmake[1]: Leaving directory '/var/tmp/work/audio/zam-plugins/work/zam-plugins-3.14/dpf/dgl' gmake: *** [Makefile:19: libs] Error 2 gmake: *** Waiting for unfinished jobs.... gmake[1]: Leaving directory '/var/tmp/work/audio/zam-plugins/work/zam-plugins-3.14/dpf/utils/lv2-ttl-generator' *** Error code 2 Stop. bmake[1]: stopped making "all" in /Volumes/data/jenkins/workspace/pkgsrc-macos-trunk-arm64/audio/zam-plugins *** Error code 1 Stop. bmake: stopped making "all" in /Volumes/data/jenkins/workspace/pkgsrc-macos-trunk-arm64/audio/zam-plugins