=> "/opt/pkg/bin/bmake" ["-C", "/data/jenkins/workspace/pkgsrc-upstream-trunk/lang/gambc", "all", "BATCH=1", "DEPENDS_TARGET=/nonexistent"]
===> Building for gambc-4.9.8
*** using a dummy gsc-boot
gmake[1]: Entering directory '/tmp/work/lang/gambc/work/gambit-v4_9_8'
rm -f gsc-boot gsc-boot
cp gsc-boot.bat.windows gsc-boot
cp gsc-boot.unix gsc-boot
chmod +x gsc-boot
gmake[1]: Leaving directory '/tmp/work/lang/gambc/work/gambit-v4_9_8'
/opt/pkg/bin/gmake stamp
gmake[1]: Entering directory '/tmp/work/lang/gambc/work/gambit-v4_9_8'
gmake[2]: Entering directory '/tmp/work/lang/gambc/work/gambit-v4_9_8/include'
Gambit is not being built from a Git clone. Creating empty stamp.h.
gmake[2]: Leaving directory '/tmp/work/lang/gambc/work/gambit-v4_9_8/include'
gmake[1]: Leaving directory '/tmp/work/lang/gambc/work/gambit-v4_9_8'
gmake[1]: Entering directory '/tmp/work/lang/gambc/work/gambit-v4_9_8'
*** making phase1
gmake[2]: Entering directory '/tmp/work/lang/gambc/work/gambit-v4_9_8'
making phase1 in include
making phase1 in lib
making phase1 in gsi
making phase1 in bin
gmake[3]: Entering directory '/tmp/work/lang/gambc/work/gambit-v4_9_8/include'
gmake[3]: Entering directory '/tmp/work/lang/gambc/work/gambit-v4_9_8/bin'
rm -f gambvcs
gmake[3]: Entering directory '/tmp/work/lang/gambc/work/gambit-v4_9_8/gsi'
gmake[3]: Nothing to be done for 'phase1'.
gmake[3]: Leaving directory '/tmp/work/lang/gambc/work/gambit-v4_9_8/gsi'
if test "" = ""; then \
cp gambvcs.unix gambvcs; \
chmod +x gambvcs; \
else \
sed "s/\$/\r/g" gambvcs.bat.windows > gambvcs; \
fi
gmake[3]: Entering directory '/tmp/work/lang/gambc/work/gambit-v4_9_8/lib'
gmake[3]: Nothing to be done for 'phase1'.
gmake[3]: Leaving directory '/tmp/work/lang/gambc/work/gambit-v4_9_8/lib'
rm -f gambuild-C
if test "" = ""; then \
cp gambuild-C.unix gambuild-C; \
chmod +x gambuild-C; \
else \
sed "s/\$/\r/g" gambuild-C.bat.windows > gambuild-C; \
fi
rm -f gambuild-js
if test "" = ""; then \
cp gambuild-js.unix gambuild-js; \
chmod +x gambuild-js; \
else \
sed "s/\$/\r/g" gambuild-js.bat.windows > gambuild-js; \
fi
making phase1 in gsc
rm -f gambuild-python
if test "" = ""; then \
cp gambuild-python.unix gambuild-python; \
chmod +x gambuild-python; \
else \
sed "s/\$/\r/g" gambuild-python.bat.windows > gambuild-python; \
fi
gmake[3]: Entering directory '/tmp/work/lang/gambc/work/gambit-v4_9_8/gsc'
gmake[3]: Nothing to be done for 'phase1'.
gmake[3]: Leaving directory '/tmp/work/lang/gambc/work/gambit-v4_9_8/gsc'
expr: non-numeric argument
rm -f gambuild-ruby
rm -f gambuild-php
if test "" = ""; then \
cp gambuild-ruby.unix gambuild-ruby; \
chmod +x gambuild-ruby; \
else \
sed "s/\$/\r/g" gambuild-ruby.bat.windows > gambuild-ruby; \
fi
if test "" = ""; then \
cp gambuild-php.unix gambuild-php; \
chmod +x gambuild-php; \
else \
sed "s/\$/\r/g" gambuild-php.bat.windows > gambuild-php; \
fi
rm -f gambuild-java
gmake[3]: Leaving directory '/tmp/work/lang/gambc/work/gambit-v4_9_8/include'
if test "" = ""; then \
cp gambuild-java.unix gambuild-java; \
chmod +x gambuild-java; \
else \
sed "s/\$/\r/g" gambuild-java.bat.windows > gambuild-java; \
fi
rm -f gambuild-x86
if test "" = ""; then \
cp gambuild-x86.unix gambuild-x86; \
chmod +x gambuild-x86; \
else \
sed "s/\$/\r/g" gambuild-x86.bat.windows > gambuild-x86; \
fi
rm -f gambuild-x86-64
rm -f gambuild-arm
if test "" = ""; then \
cp gambuild-x86-64.unix gambuild-x86-64; \
chmod +x gambuild-x86-64; \
else \
sed "s/\$/\r/g" gambuild-x86-64.bat.windows > gambuild-x86-64; \
fi
if test "" = ""; then \
cp gambuild-arm.unix gambuild-arm; \
chmod +x gambuild-arm; \
else \
sed "s/\$/\r/g" gambuild-arm.bat.windows > gambuild-arm; \
fi
rm -f gambuild-riscv-32
if test "" = ""; then \
cp gambuild-riscv-32.unix gambuild-riscv-32; \
chmod +x gambuild-riscv-32; \
else \
sed "s/\$/\r/g" gambuild-riscv-32.bat.windows > gambuild-riscv-32; \
fi
rm -f gambuild-riscv-64
rm -f gambdoc
rm -f six six.lnk
if test "" = ""; then \
cp gambuild-riscv-64.unix gambuild-riscv-64; \
chmod +x gambuild-riscv-64; \
else \
sed "s/\$/\r/g" gambuild-riscv-64.bat.windows > gambuild-riscv-64; \
fi
if test "" = ""; then \
cp gambdoc.unix gambdoc; \
chmod +x gambdoc; \
else \
sed "s/\$/\r/g" gambdoc.bat.windows > gambdoc; \
fi
if test "" = ""; then \
ln -s ../gsi/gsi six; \
else \
echo "@%~dp0gsi %*" > six; \
fi
rm -f gsi-script gsi-script.lnk
if test "" = ""; then \
ln -s ../gsi/gsi gsi-script; \
else \
echo "@%~dp0gsi %*" > gsi-script; \
fi
rm -f gsc-script gsc-script.lnk
if test "" = ""; then \
ln -s ../gsc/gsc gsc-script; \
else \
echo "@%~dp0gsc %*" > gsc-script; \
fi
rm -f six-script six-script.lnk
rm -f scheme-srfi-0 scheme-srfi-0.lnk
if test "" = ""; then \
ln -s ../gsi/gsi six-script; \
else \
echo "@%~dp0gsi %*" > six-script; \
fi
if test "" = ""; then \
ln -s ../gsi/gsi scheme-srfi-0; \
else \
echo "@%~dp0gsi %*" > scheme-srfi-0; \
fi
rm -f scheme-r5rs scheme-r5rs.lnk
if test "" = ""; then \
ln -s ../gsi/gsi scheme-r5rs; \
else \
echo "@%~dp0gsi %*" > scheme-r5rs; \
fi
rm -f scheme-r4rs scheme-r4rs.lnk
if test "" = ""; then \
ln -s ../gsi/gsi scheme-r4rs; \
else \
echo "@%~dp0gsi %*" > scheme-r4rs; \
fi
rm -f scheme-ieee-1178-1990 scheme-ieee-1178-1990.lnk
if test "" = ""; then \
ln -s ../gsi/gsi scheme-ieee-1178-1990; \
else \
echo "@%~dp0gsi %*" > scheme-ieee-1178-1990; \
fi
gmake[3]: Leaving directory '/tmp/work/lang/gambc/work/gambit-v4_9_8/bin'
gmake[2]: Leaving directory '/tmp/work/lang/gambc/work/gambit-v4_9_8'
*** making phase2
gmake[2]: Entering directory '/tmp/work/lang/gambc/work/gambit-v4_9_8'
making phase2 in bin
making phase2 in lib
making phase2 in gsi
making phase2 in include
gmake[3]: Entering directory '/tmp/work/lang/gambc/work/gambit-v4_9_8/bin'
gmake[3]: Nothing to be done for 'phase2'.
gmake[3]: Leaving directory '/tmp/work/lang/gambc/work/gambit-v4_9_8/bin'
gmake[3]: Entering directory '/tmp/work/lang/gambc/work/gambit-v4_9_8/include'
gmake[3]: Nothing to be done for 'phase2'.
gmake[3]: Leaving directory '/tmp/work/lang/gambc/work/gambit-v4_9_8/include'
gmake[3]: Entering directory '/tmp/work/lang/gambc/work/gambit-v4_9_8/gsi'
gmake[3]: Nothing to be done for 'phase2'.
gmake[3]: Leaving directory '/tmp/work/lang/gambc/work/gambit-v4_9_8/gsi'
gmake[3]: Entering directory '/tmp/work/lang/gambc/work/gambit-v4_9_8/lib'
gmake[3]: Nothing to be done for 'phase2'.
gmake[3]: Leaving directory '/tmp/work/lang/gambc/work/gambit-v4_9_8/lib'
making phase2 in gsc
gmake[3]: Entering directory '/tmp/work/lang/gambc/work/gambit-v4_9_8/gsc'
gmake[3]: Nothing to be done for 'phase2'.
gmake[3]: Leaving directory '/tmp/work/lang/gambc/work/gambit-v4_9_8/gsc'
gmake[2]: Leaving directory '/tmp/work/lang/gambc/work/gambit-v4_9_8'
*** making phase3
gmake[2]: Entering directory '/tmp/work/lang/gambc/work/gambit-v4_9_8'
making phase3 in lib
making phase3 in bin
making phase3 in include
making phase3 in gsi
gmake[3]: Entering directory '/tmp/work/lang/gambc/work/gambit-v4_9_8/bin'
gmake[3]: Nothing to be done for 'phase3'.
gmake[3]: Leaving directory '/tmp/work/lang/gambc/work/gambit-v4_9_8/bin'
gmake[3]: Entering directory '/tmp/work/lang/gambc/work/gambit-v4_9_8/gsi'
gmake[3]: Entering directory '/tmp/work/lang/gambc/work/gambit-v4_9_8/include'
gmake[3]: Nothing to be done for 'phase3'.
gmake[3]: Leaving directory '/tmp/work/lang/gambc/work/gambit-v4_9_8/include'
gmake[3]: Entering directory '/tmp/work/lang/gambc/work/gambit-v4_9_8/lib'
g++ -O1 -fexpensive-optimizations -fno-gcse -pipe -O2 -msave-args -fno-aggressive-loop-optimizations -I/usr/include -I/opt/pkg/include/ncurses -I"../include" -c -o _io.o -I. -DHAVE_CONFIG_H -D___GAMBITDIR="\"/opt/pkg\"" -D___GAMBITDIR_INFO="\"/opt/pkg/info\"" -D___GAMBITDIR_USERLIB="\"\176/.gambit_userlib\"" -D___GAMBITDIR_INSTLIB="\"\176\176userlib\"" -D___SYS_TYPE_CPU="\"x86_64\"" -D___SYS_TYPE_VENDOR="\"sun\"" -D___SYS_TYPE_OS="\"solaris2.11\"" -D___CONFIGURE_COMMAND="\"./configure '--enable-single-host' '--enable-cplusplus' '--enable-shared' '--disable-absolute-shared-libs' '--enable-default-runtime-options=f8,-8,t8' '--enable-compiler-name=gsc-gambit' '--enable-interpreter-name=gsi-gambit' '--enable-gcc-opts' '--prefix=/opt/pkg' '--build=x86_64-sun-solaris2.11' '--host=x86_64-sun-solaris2.11' '--infodir=/opt/pkg/info' '--mandir=/opt/pkg/share/man' '--enable-option-checking=yes' 'build_alias=x86_64-sun-solaris2.11' 'host_alias=x86_64-sun-solaris2.11' 'CC=gcc' 'CFLAGS=-pipe -O2 -msave-args -fno-aggressive-loop-optimizations -I/usr/include -I/opt/pkg/include/ncurses' 'LDFLAGS=-L/usr/lib/amd64 -Wl,-R/usr/lib/amd64 -L/opt/pkg/lib -Wl,-R/opt/pkg/lib' 'LIBS=' 'CPPFLAGS=-I/usr/include -I/opt/pkg/include/ncurses' 'CXX=g++' 'CXXFLAGS=-pipe -O2 -msave-args -fno-aggressive-loop-optimizations -I/usr/include -I/opt/pkg/include/ncurses'"\" -D___OBJ_EXTENSION="\".o\"" -D___EXE_EXTENSION="\"\"" -D___BAT_EXTENSION="\"\"" -D___PRIMAL _io.c -D___LIBRARY
g++ -O1 -fexpensive-optimizations -fno-gcse -pipe -O2 -msave-args -fno-aggressive-loop-optimizations -I/usr/include -I/opt/pkg/include/ncurses -I"../include" -c -o _num.o -I. -DHAVE_CONFIG_H -D___GAMBITDIR="\"/opt/pkg\"" -D___GAMBITDIR_INFO="\"/opt/pkg/info\"" -D___GAMBITDIR_USERLIB="\"\176/.gambit_userlib\"" -D___GAMBITDIR_INSTLIB="\"\176\176userlib\"" -D___SYS_TYPE_CPU="\"x86_64\"" -D___SYS_TYPE_VENDOR="\"sun\"" -D___SYS_TYPE_OS="\"solaris2.11\"" -D___CONFIGURE_COMMAND="\"./configure '--enable-single-host' '--enable-cplusplus' '--enable-shared' '--disable-absolute-shared-libs' '--enable-default-runtime-options=f8,-8,t8' '--enable-compiler-name=gsc-gambit' '--enable-interpreter-name=gsi-gambit' '--enable-gcc-opts' '--prefix=/opt/pkg' '--build=x86_64-sun-solaris2.11' '--host=x86_64-sun-solaris2.11' '--infodir=/opt/pkg/info' '--mandir=/opt/pkg/share/man' '--enable-option-checking=yes' 'build_alias=x86_64-sun-solaris2.11' 'host_alias=x86_64-sun-solaris2.11' 'CC=gcc' 'CFLAGS=-pipe -O2 -msave-args -fno-aggressive-loop-optimizations -I/usr/include -I/opt/pkg/include/ncurses' 'LDFLAGS=-L/usr/lib/amd64 -Wl,-R/usr/lib/amd64 -L/opt/pkg/lib -Wl,-R/opt/pkg/lib' 'LIBS=' 'CPPFLAGS=-I/usr/include -I/opt/pkg/include/ncurses' 'CXX=g++' 'CXXFLAGS=-pipe -O2 -msave-args -fno-aggressive-loop-optimizations -I/usr/include -I/opt/pkg/include/ncurses'"\" -D___OBJ_EXTENSION="\".o\"" -D___EXE_EXTENSION="\"\"" -D___BAT_EXTENSION="\"\"" -D___PRIMAL _num.c -D___LIBRARY
gmake[4]: Entering directory '/tmp/work/lang/gambc/work/gambit-v4_9_8/gsi'
g++ -O1 -fexpensive-optimizations -fno-gcse -pipe -O2 -msave-args -fno-aggressive-loop-optimizations -I/usr/include -I/opt/pkg/include/ncurses -I"../include" -c -o _gsilib.o -I. -DHAVE_CONFIG_H _gsilib.c -D___LIBRARY
making phase3 in gsc
gmake[3]: Entering directory '/tmp/work/lang/gambc/work/gambit-v4_9_8/gsc'
gmake[4]: Entering directory '/tmp/work/lang/gambc/work/gambit-v4_9_8/gsc'
g++ -O1 -fexpensive-optimizations -fno-gcse -pipe -O2 -msave-args -fno-aggressive-loop-optimizations -I/usr/include -I/opt/pkg/include/ncurses -I"../include" -c -o _t-univ-2.o -I. -DHAVE_CONFIG_H _t-univ-2.c -D___LIBRARY
_gsilib.c:28:24: warning: deprecated conversion from string constant to 'char*' [-Wwrite-strings]
28 | #define ___MODULE_NAME "_gsilib"
| ^~~~~~~~~
../include/gambit.h:9415:3: note: in expansion of macro '___MODULE_NAME'
9415 | ___MODULE_NAME, \
| ^~~~~~~~~~~~~~
_gsilib.c:140:1: note: in expansion of macro '___BEGIN_MOD_SYM_KEY'
140 | ___BEGIN_MOD_SYM_KEY
| ^~~~~~~~~~~~~~~~~~~~
g++ -O1 -fexpensive-optimizations -fno-gcse -pipe -O2 -msave-args -fno-aggressive-loop-optimizations -I/usr/include -I/opt/pkg/include/ncurses -I"../include" -c -o _gambitgsi.o -I. -DHAVE_CONFIG_H _gambitgsi.c -D___LIBRARY
_gambitgsi.c:10833:26: warning: deprecated conversion from string constant to 'char*' [-Wwrite-strings]
10833 | #define ___LINKFILE_NAME "_gambitgsi"
| ^~~~~~~~~~~~
../include/gambit.h:9541:3: note: in expansion of macro '___LINKFILE_NAME'
9541 | ___LINKFILE_NAME, \
| ^~~~~~~~~~~~~~~~
../include/gambit.h:8893:44: note: in expansion of macro '___LINKFILE_DESCR'
8893 | #define ___END_NEW_SYM_GLO(prevsym,prevkey)___LINKFILE_DESCR(prevsym,prevkey)
| ^~~~~~~~~~~~~~~~~
_gambitgsi.c:17100:1: note: in expansion of macro '___END_NEW_SYM_GLO'
17100 | ___END_NEW_SYM_GLO(___S___gsilib_23_,0)
| ^~~~~~~~~~~~~~~~~~
gmake[4]: Leaving directory '/tmp/work/lang/gambc/work/gambit-v4_9_8/gsi'
gmake[3]: Leaving directory '/tmp/work/lang/gambc/work/gambit-v4_9_8/gsi'
g++ -O1 -fexpensive-optimizations -fno-gcse -pipe -O2 -msave-args -fno-aggressive-loop-optimizations -I/usr/include -I/opt/pkg/include/ncurses -I"../include" -c -o _std.o -I. -DHAVE_CONFIG_H -D___GAMBITDIR="\"/opt/pkg\"" -D___GAMBITDIR_INFO="\"/opt/pkg/info\"" -D___GAMBITDIR_USERLIB="\"\176/.gambit_userlib\"" -D___GAMBITDIR_INSTLIB="\"\176\176userlib\"" -D___SYS_TYPE_CPU="\"x86_64\"" -D___SYS_TYPE_VENDOR="\"sun\"" -D___SYS_TYPE_OS="\"solaris2.11\"" -D___CONFIGURE_COMMAND="\"./configure '--enable-single-host' '--enable-cplusplus' '--enable-shared' '--disable-absolute-shared-libs' '--enable-default-runtime-options=f8,-8,t8' '--enable-compiler-name=gsc-gambit' '--enable-interpreter-name=gsi-gambit' '--enable-gcc-opts' '--prefix=/opt/pkg' '--build=x86_64-sun-solaris2.11' '--host=x86_64-sun-solaris2.11' '--infodir=/opt/pkg/info' '--mandir=/opt/pkg/share/man' '--enable-option-checking=yes' 'build_alias=x86_64-sun-solaris2.11' 'host_alias=x86_64-sun-solaris2.11' 'CC=gcc' 'CFLAGS=-pipe -O2 -msave-args -fno-aggressive-loop-optimizations -I/usr/include -I/opt/pkg/include/ncurses' 'LDFLAGS=-L/usr/lib/amd64 -Wl,-R/usr/lib/amd64 -L/opt/pkg/lib -Wl,-R/opt/pkg/lib' 'LIBS=' 'CPPFLAGS=-I/usr/include -I/opt/pkg/include/ncurses' 'CXX=g++' 'CXXFLAGS=-pipe -O2 -msave-args -fno-aggressive-loop-optimizations -I/usr/include -I/opt/pkg/include/ncurses'"\" -D___OBJ_EXTENSION="\".o\"" -D___EXE_EXTENSION="\"\"" -D___BAT_EXTENSION="\"\"" -D___PRIMAL _std.c -D___LIBRARY
In file included from _num.c:1725:
_num.c: In function 'void _____num_23_1(___processor_state)':
../include/gambit.h:2235:35: warning: extended initializer lists only available with '-std=c++11' or '-std=gnu++11' [-Wc++11-extensions]
2235 | #define ___F32_TO_U32(x)___F32_U32{x}.u32
| ^
../include/gambit.h:10312:34: note: in definition of macro '___CFUN_ASSIGN'
10312 | #define ___CFUN_ASSIGN(r,val)r = val;
| ^~~
_num.c:16746:1: note: in expansion of macro '___return'
16746 | ___return(___F32_TO_U32(___arg1));
| ^~~~~~~~~
_num.c:16746:11: note: in expansion of macro '___F32_TO_U32'
16746 | ___return(___F32_TO_U32(___arg1));
| ^~~~~~~~~~~~~
_num.c: In function 'void _____num_23_2(___processor_state)':
../include/gambit.h:2236:37: warning: extended initializer lists only available with '-std=c++11' or '-std=gnu++11' [-Wc++11-extensions]
2236 | #define ___F32_FROM_U32(x)___U32_F32{x}.f32
| ^
../include/gambit.h:10312:34: note: in definition of macro '___CFUN_ASSIGN'
10312 | #define ___CFUN_ASSIGN(r,val)r = val;
| ^~~
_num.c:16773:1: note: in expansion of macro '___return'
16773 | ___return(___F32_FROM_U32(___arg1));
| ^~~~~~~~~
_num.c:16773:11: note: in expansion of macro '___F32_FROM_U32'
16773 | ___return(___F32_FROM_U32(___arg1));
| ^~~~~~~~~~~~~~~
_num.c: In function 'void _____num_23_3(___processor_state)':
../include/gambit.h:2237:35: warning: extended initializer lists only available with '-std=c++11' or '-std=gnu++11' [-Wc++11-extensions]
2237 | #define ___F64_TO_U64(x)___F64_U64{x}.u64
| ^
../include/gambit.h:10312:34: note: in definition of macro '___CFUN_ASSIGN'
10312 | #define ___CFUN_ASSIGN(r,val)r = val;
| ^~~
_num.c:16800:1: note: in expansion of macro '___return'
16800 | ___return(___F64_TO_U64(___arg1));
| ^~~~~~~~~
_num.c:16800:11: note: in expansion of macro '___F64_TO_U64'
16800 | ___return(___F64_TO_U64(___arg1));
| ^~~~~~~~~~~~~
_num.c: In function 'void _____num_23_4(___processor_state)':
../include/gambit.h:2238:37: warning: extended initializer lists only available with '-std=c++11' or '-std=gnu++11' [-Wc++11-extensions]
2238 | #define ___F64_FROM_U64(x)___U64_F64{x}.f64
| ^
../include/gambit.h:10312:34: note: in definition of macro '___CFUN_ASSIGN'
10312 | #define ___CFUN_ASSIGN(r,val)r = val;
| ^~~
_num.c:16827:1: note: in expansion of macro '___return'
16827 | ___return(___F64_FROM_U64(___arg1));
| ^~~~~~~~~
_num.c:16827:11: note: in expansion of macro '___F64_FROM_U64'
16827 | ___return(___F64_FROM_U64(___arg1));
| ^~~~~~~~~~~~~~~
_t-univ-2.c:865:24: warning: deprecated conversion from string constant to 'char*' [-Wwrite-strings]
865 | #define ___MODULE_NAME "_t-univ-2"
| ^~~~~~~~~~~
../include/gambit.h:9415:3: note: in expansion of macro '___MODULE_NAME'
9415 | ___MODULE_NAME, \
| ^~~~~~~~~~~~~~
_t-univ-2.c:80079:1: note: in expansion of macro '___BEGIN_MOD_SYM_KEY'
80079 | ___BEGIN_MOD_SYM_KEY
| ^~~~~~~~~~~~~~~~~~~~
g++ -O1 -fexpensive-optimizations -fno-gcse -pipe -O2 -msave-args -fno-aggressive-loop-optimizations -I/usr/include -I/opt/pkg/include/ncurses -I"../include" -c -o _t-univ-3.o -I. -DHAVE_CONFIG_H _t-univ-3.c -D___LIBRARY
_io.c:2331:24: warning: deprecated conversion from string constant to 'char*' [-Wwrite-strings]
2331 | #define ___MODULE_NAME "_io"
| ^~~~~
../include/gambit.h:9415:3: note: in expansion of macro '___MODULE_NAME'
9415 | ___MODULE_NAME, \
| ^~~~~~~~~~~~~~
_io.c:103096:1: note: in expansion of macro '___BEGIN_MOD_SYM_KEY'
103096 | ___BEGIN_MOD_SYM_KEY
| ^~~~~~~~~~~~~~~~~~~~
g++ -O1 -fexpensive-optimizations -fno-gcse -pipe -O2 -msave-args -fno-aggressive-loop-optimizations -I/usr/include -I/opt/pkg/include/ncurses -I"../include" -c -o _t-univ-1.o -I. -DHAVE_CONFIG_H _t-univ-1.c -D___LIBRARY
_t-univ-3.c:1215:24: warning: deprecated conversion from string constant to 'char*' [-Wwrite-strings]
1215 | #define ___MODULE_NAME "_t-univ-3"
| ^~~~~~~~~~~
../include/gambit.h:9415:3: note: in expansion of macro '___MODULE_NAME'
9415 | ___MODULE_NAME, \
| ^~~~~~~~~~~~~~
_t-univ-3.c:52163:1: note: in expansion of macro '___BEGIN_MOD_SYM_KEY'
52163 | ___BEGIN_MOD_SYM_KEY
| ^~~~~~~~~~~~~~~~~~~~
g++ -O1 -fexpensive-optimizations -fno-gcse -pipe -O2 -msave-args -fno-aggressive-loop-optimizations -I/usr/include -I/opt/pkg/include/ncurses -I"../include" -c -o _repl.o -I. -DHAVE_CONFIG_H -D___GAMBITDIR="\"/opt/pkg\"" -D___GAMBITDIR_INFO="\"/opt/pkg/info\"" -D___GAMBITDIR_USERLIB="\"\176/.gambit_userlib\"" -D___GAMBITDIR_INSTLIB="\"\176\176userlib\"" -D___SYS_TYPE_CPU="\"x86_64\"" -D___SYS_TYPE_VENDOR="\"sun\"" -D___SYS_TYPE_OS="\"solaris2.11\"" -D___CONFIGURE_COMMAND="\"./configure '--enable-single-host' '--enable-cplusplus' '--enable-shared' '--disable-absolute-shared-libs' '--enable-default-runtime-options=f8,-8,t8' '--enable-compiler-name=gsc-gambit' '--enable-interpreter-name=gsi-gambit' '--enable-gcc-opts' '--prefix=/opt/pkg' '--build=x86_64-sun-solaris2.11' '--host=x86_64-sun-solaris2.11' '--infodir=/opt/pkg/info' '--mandir=/opt/pkg/share/man' '--enable-option-checking=yes' 'build_alias=x86_64-sun-solaris2.11' 'host_alias=x86_64-sun-solaris2.11' 'CC=gcc' 'CFLAGS=-pipe -O2 -msave-args -fno-aggressive-loop-optimizations -I/usr/include -I/opt/pkg/include/ncurses' 'LDFLAGS=-L/usr/lib/amd64 -Wl,-R/usr/lib/amd64 -L/opt/pkg/lib -Wl,-R/opt/pkg/lib' 'LIBS=' 'CPPFLAGS=-I/usr/include -I/opt/pkg/include/ncurses' 'CXX=g++' 'CXXFLAGS=-pipe -O2 -msave-args -fno-aggressive-loop-optimizations -I/usr/include -I/opt/pkg/include/ncurses'"\" -D___OBJ_EXTENSION="\".o\"" -D___EXE_EXTENSION="\"\"" -D___BAT_EXTENSION="\"\"" -D___PRIMAL _repl.c -D___LIBRARY
_t-univ-1.c:1272:24: warning: deprecated conversion from string constant to 'char*' [-Wwrite-strings]
1272 | #define ___MODULE_NAME "_t-univ-1"
| ^~~~~~~~~~~
../include/gambit.h:9415:3: note: in expansion of macro '___MODULE_NAME'
9415 | ___MODULE_NAME, \
| ^~~~~~~~~~~~~~
_t-univ-1.c:53634:1: note: in expansion of macro '___BEGIN_MOD_SYM_KEY'
53634 | ___BEGIN_MOD_SYM_KEY
| ^~~~~~~~~~~~~~~~~~~~
_repl.c:1486:24: warning: deprecated conversion from string constant to 'char*' [-Wwrite-strings]
1486 | #define ___MODULE_NAME "_repl"
| ^~~~~~~
../include/gambit.h:9415:3: note: in expansion of macro '___MODULE_NAME'
9415 | ___MODULE_NAME, \
| ^~~~~~~~~~~~~~
_repl.c:46321:1: note: in expansion of macro '___BEGIN_MOD_SYM_KEY'
46321 | ___BEGIN_MOD_SYM_KEY
| ^~~~~~~~~~~~~~~~~~~~
g++ -O1 -fexpensive-optimizations -fno-gcse -pipe -O2 -msave-args -fno-aggressive-loop-optimizations -I/usr/include -I/opt/pkg/include/ncurses -I"../include" -c -o _prims.o -I. -DHAVE_CONFIG_H _prims.c -D___LIBRARY
g++ -O1 -fexpensive-optimizations -fno-gcse -pipe -O2 -msave-args -fno-aggressive-loop-optimizations -I/usr/include -I/opt/pkg/include/ncurses -I"../include" -c -o _t-univ-4.o -I. -DHAVE_CONFIG_H _t-univ-4.c -D___LIBRARY
_t-univ-4.c:501:24: warning: deprecated conversion from string constant to 'char*' [-Wwrite-strings]
501 | #define ___MODULE_NAME "_t-univ-4"
| ^~~~~~~~~~~
../include/gambit.h:9415:3: note: in expansion of macro '___MODULE_NAME'
9415 | ___MODULE_NAME, \
| ^~~~~~~~~~~~~~
_t-univ-4.c:42818:1: note: in expansion of macro '___BEGIN_MOD_SYM_KEY'
42818 | ___BEGIN_MOD_SYM_KEY
| ^~~~~~~~~~~~~~~~~~~~
_prims.c:360:24: warning: deprecated conversion from string constant to 'char*' [-Wwrite-strings]
360 | #define ___MODULE_NAME "_prims"
| ^~~~~~~~
../include/gambit.h:9415:3: note: in expansion of macro '___MODULE_NAME'
9415 | ___MODULE_NAME, \
| ^~~~~~~~~~~~~~
_prims.c:80980:1: note: in expansion of macro '___BEGIN_MOD_SYM_KEY'
80980 | ___BEGIN_MOD_SYM_KEY
| ^~~~~~~~~~~~~~~~~~~~
g++ -O1 -fexpensive-optimizations -fno-gcse -pipe -O2 -msave-args -fno-aggressive-loop-optimizations -I/usr/include -I/opt/pkg/include/ncurses -I"../include" -c -o _eval.o -I. -DHAVE_CONFIG_H -D___GAMBITDIR="\"/opt/pkg\"" -D___GAMBITDIR_INFO="\"/opt/pkg/info\"" -D___GAMBITDIR_USERLIB="\"\176/.gambit_userlib\"" -D___GAMBITDIR_INSTLIB="\"\176\176userlib\"" -D___SYS_TYPE_CPU="\"x86_64\"" -D___SYS_TYPE_VENDOR="\"sun\"" -D___SYS_TYPE_OS="\"solaris2.11\"" -D___CONFIGURE_COMMAND="\"./configure '--enable-single-host' '--enable-cplusplus' '--enable-shared' '--disable-absolute-shared-libs' '--enable-default-runtime-options=f8,-8,t8' '--enable-compiler-name=gsc-gambit' '--enable-interpreter-name=gsi-gambit' '--enable-gcc-opts' '--prefix=/opt/pkg' '--build=x86_64-sun-solaris2.11' '--host=x86_64-sun-solaris2.11' '--infodir=/opt/pkg/info' '--mandir=/opt/pkg/share/man' '--enable-option-checking=yes' 'build_alias=x86_64-sun-solaris2.11' 'host_alias=x86_64-sun-solaris2.11' 'CC=gcc' 'CFLAGS=-pipe -O2 -msave-args -fno-aggressive-loop-optimizations -I/usr/include -I/opt/pkg/include/ncurses' 'LDFLAGS=-L/usr/lib/amd64 -Wl,-R/usr/lib/amd64 -L/opt/pkg/lib -Wl,-R/opt/pkg/lib' 'LIBS=' 'CPPFLAGS=-I/usr/include -I/opt/pkg/include/ncurses' 'CXX=g++' 'CXXFLAGS=-pipe -O2 -msave-args -fno-aggressive-loop-optimizations -I/usr/include -I/opt/pkg/include/ncurses'"\" -D___OBJ_EXTENSION="\".o\"" -D___EXE_EXTENSION="\"\"" -D___BAT_EXTENSION="\"\"" -D___PRIMAL _eval.c -D___LIBRARY
g++ -O1 -fexpensive-optimizations -fno-gcse -pipe -O2 -msave-args -fno-aggressive-loop-optimizations -I/usr/include -I/opt/pkg/include/ncurses -I"../include" -c -o _t-c-2.o -I. -DHAVE_CONFIG_H _t-c-2.c -D___LIBRARY
_eval.c:1432:24: warning: deprecated conversion from string constant to 'char*' [-Wwrite-strings]
1432 | #define ___MODULE_NAME "_eval"
| ^~~~~~~
../include/gambit.h:9415:3: note: in expansion of macro '___MODULE_NAME'
9415 | ___MODULE_NAME, \
| ^~~~~~~~~~~~~~
_eval.c:45256:1: note: in expansion of macro '___BEGIN_MOD_SYM_KEY'
45256 | ___BEGIN_MOD_SYM_KEY
| ^~~~~~~~~~~~~~~~~~~~
_t-c-2.c:583:24: warning: deprecated conversion from string constant to 'char*' [-Wwrite-strings]
583 | #define ___MODULE_NAME "_t-c-2"
| ^~~~~~~~
../include/gambit.h:9415:3: note: in expansion of macro '___MODULE_NAME'
9415 | ___MODULE_NAME, \
| ^~~~~~~~~~~~~~
_t-c-2.c:43827:1: note: in expansion of macro '___BEGIN_MOD_SYM_KEY'
43827 | ___BEGIN_MOD_SYM_KEY
| ^~~~~~~~~~~~~~~~~~~~
g++ -O1 -fexpensive-optimizations -fno-gcse -pipe -O2 -msave-args -fno-aggressive-loop-optimizations -I/usr/include -I/opt/pkg/include/ncurses -I"../include" -c -o _front.o -I. -DHAVE_CONFIG_H _front.c -D___LIBRARY
g++ -O1 -fexpensive-optimizations -fno-gcse -pipe -O2 -msave-args -fno-aggressive-loop-optimizations -I/usr/include -I/opt/pkg/include/ncurses -I"../include" -c -o _ptree1.o -I. -DHAVE_CONFIG_H _ptree1.c -D___LIBRARY
_ptree1.c:791:24: warning: deprecated conversion from string constant to 'char*' [-Wwrite-strings]
791 | #define ___MODULE_NAME "_ptree1"
| ^~~~~~~~~
../include/gambit.h:9415:3: note: in expansion of macro '___MODULE_NAME'
9415 | ___MODULE_NAME, \
| ^~~~~~~~~~~~~~
_ptree1.c:31312:1: note: in expansion of macro '___BEGIN_MOD_SYM_KEY'
31312 | ___BEGIN_MOD_SYM_KEY
| ^~~~~~~~~~~~~~~~~~~~
g++ -O1 -fexpensive-optimizations -fno-gcse -pipe -O2 -msave-args -fno-aggressive-loop-optimizations -I/usr/include -I/opt/pkg/include/ncurses -I"../include" -c -o _nonstd.o -I. -DHAVE_CONFIG_H -D___GAMBITDIR="\"/opt/pkg\"" -D___GAMBITDIR_INFO="\"/opt/pkg/info\"" -D___GAMBITDIR_USERLIB="\"\176/.gambit_userlib\"" -D___GAMBITDIR_INSTLIB="\"\176\176userlib\"" -D___SYS_TYPE_CPU="\"x86_64\"" -D___SYS_TYPE_VENDOR="\"sun\"" -D___SYS_TYPE_OS="\"solaris2.11\"" -D___CONFIGURE_COMMAND="\"./configure '--enable-single-host' '--enable-cplusplus' '--enable-shared' '--disable-absolute-shared-libs' '--enable-default-runtime-options=f8,-8,t8' '--enable-compiler-name=gsc-gambit' '--enable-interpreter-name=gsi-gambit' '--enable-gcc-opts' '--prefix=/opt/pkg' '--build=x86_64-sun-solaris2.11' '--host=x86_64-sun-solaris2.11' '--infodir=/opt/pkg/info' '--mandir=/opt/pkg/share/man' '--enable-option-checking=yes' 'build_alias=x86_64-sun-solaris2.11' 'host_alias=x86_64-sun-solaris2.11' 'CC=gcc' 'CFLAGS=-pipe -O2 -msave-args -fno-aggressive-loop-optimizations -I/usr/include -I/opt/pkg/include/ncurses' 'LDFLAGS=-L/usr/lib/amd64 -Wl,-R/usr/lib/amd64 -L/opt/pkg/lib -Wl,-R/opt/pkg/lib' 'LIBS=' 'CPPFLAGS=-I/usr/include -I/opt/pkg/include/ncurses' 'CXX=g++' 'CXXFLAGS=-pipe -O2 -msave-args -fno-aggressive-loop-optimizations -I/usr/include -I/opt/pkg/include/ncurses'"\" -D___OBJ_EXTENSION="\".o\"" -D___EXE_EXTENSION="\"\"" -D___BAT_EXTENSION="\"\"" -D___PRIMAL _nonstd.c -D___LIBRARY
_front.c:718:24: warning: deprecated conversion from string constant to 'char*' [-Wwrite-strings]
718 | #define ___MODULE_NAME "_front"
| ^~~~~~~~
../include/gambit.h:9415:3: note: in expansion of macro '___MODULE_NAME'
9415 | ___MODULE_NAME, \
| ^~~~~~~~~~~~~~
_front.c:34489:1: note: in expansion of macro '___BEGIN_MOD_SYM_KEY'
34489 | ___BEGIN_MOD_SYM_KEY
| ^~~~~~~~~~~~~~~~~~~~
g++ -O1 -fexpensive-optimizations -fno-gcse -pipe -O2 -msave-args -fno-aggressive-loop-optimizations -I/usr/include -I/opt/pkg/include/ncurses -I"../include" -c -o _ptree2.o -I. -DHAVE_CONFIG_H _ptree2.c -D___LIBRARY
_ptree2.c:551:24: warning: deprecated conversion from string constant to 'char*' [-Wwrite-strings]
551 | #define ___MODULE_NAME "_ptree2"
| ^~~~~~~~~
../include/gambit.h:9415:3: note: in expansion of macro '___MODULE_NAME'
9415 | ___MODULE_NAME, \
| ^~~~~~~~~~~~~~
_ptree2.c:30789:1: note: in expansion of macro '___BEGIN_MOD_SYM_KEY'
30789 | ___BEGIN_MOD_SYM_KEY
| ^~~~~~~~~~~~~~~~~~~~
g++ -O1 -fexpensive-optimizations -fno-gcse -pipe -O2 -msave-args -fno-aggressive-loop-optimizations -I/usr/include -I/opt/pkg/include/ncurses -I"../include" -c -o _gvm.o -I. -DHAVE_CONFIG_H _gvm.c -D___LIBRARY
_nonstd.c:1107:24: warning: deprecated conversion from string constant to 'char*' [-Wwrite-strings]
1107 | #define ___MODULE_NAME "_nonstd"
| ^~~~~~~~~
../include/gambit.h:9415:3: note: in expansion of macro '___MODULE_NAME'
9415 | ___MODULE_NAME, \
| ^~~~~~~~~~~~~~
_nonstd.c:35853:1: note: in expansion of macro '___BEGIN_MOD_SYM_KEY'
35853 | ___BEGIN_MOD_SYM_KEY
| ^~~~~~~~~~~~~~~~~~~~
g++: internal compiler error: Cpu Limit Exceeded signal terminated program cc1plus
Please submit a full bug report, with preprocessed source (by using -freport-bug).
See for instructions.
gmake[3]: *** [makefile:298: _num.o] Error 4
g++ -O1 -fexpensive-optimizations -fno-gcse -pipe -O2 -msave-args -fno-aggressive-loop-optimizations -I/usr/include -I/opt/pkg/include/ncurses -I"../include" -c -o _t-c-1.o -I. -DHAVE_CONFIG_H _t-c-1.c -D___LIBRARY
gmake[3]: *** Waiting for unfinished jobs....
g++ -O1 -fexpensive-optimizations -fno-gcse -pipe -O2 -msave-args -fno-aggressive-loop-optimizations -I/usr/include -I/opt/pkg/include/ncurses -I"../include" -c -o _x86.o -I. -DHAVE_CONFIG_H _x86.c -D___LIBRARY
_x86.c:626:24: warning: deprecated conversion from string constant to 'char*' [-Wwrite-strings]
626 | #define ___MODULE_NAME "_x86"
| ^~~~~~
../include/gambit.h:9415:3: note: in expansion of macro '___MODULE_NAME'
9415 | ___MODULE_NAME, \
| ^~~~~~~~~~~~~~
_x86.c:26342:1: note: in expansion of macro '___BEGIN_MOD_SYM_KEY'
26342 | ___BEGIN_MOD_SYM_KEY
| ^~~~~~~~~~~~~~~~~~~~
g++ -O1 -fexpensive-optimizations -fno-gcse -pipe -O2 -msave-args -fno-aggressive-loop-optimizations -I/usr/include -I/opt/pkg/include/ncurses -I"../include" -c -o _t-cpu-abstract-machine.o -I. -DHAVE_CONFIG_H _t-cpu-abstract-machine.c -D___LIBRARY
_t-c-1.c:655:24: warning: deprecated conversion from string constant to 'char*' [-Wwrite-strings]
655 | #define ___MODULE_NAME "_t-c-1"
| ^~~~~~~~
../include/gambit.h:9415:3: note: in expansion of macro '___MODULE_NAME'
9415 | ___MODULE_NAME, \
| ^~~~~~~~~~~~~~
_t-c-1.c:23996:1: note: in expansion of macro '___BEGIN_MOD_SYM_KEY'
23996 | ___BEGIN_MOD_SYM_KEY
| ^~~~~~~~~~~~~~~~~~~~
g++ -O1 -fexpensive-optimizations -fno-gcse -pipe -O2 -msave-args -fno-aggressive-loop-optimizations -I/usr/include -I/opt/pkg/include/ncurses -I"../include" -c -o _t-cpu-backend-x86.o -I. -DHAVE_CONFIG_H _t-cpu-backend-x86.c -D___LIBRARY
_t-cpu-backend-x86.c:639:24: warning: deprecated conversion from string constant to 'char*' [-Wwrite-strings]
639 | #define ___MODULE_NAME "_t-cpu-backend-x86"
| ^~~~~~~~~~~~~~~~~~~~
../include/gambit.h:9415:3: note: in expansion of macro '___MODULE_NAME'
9415 | ___MODULE_NAME, \
| ^~~~~~~~~~~~~~
_t-cpu-backend-x86.c:24010:1: note: in expansion of macro '___BEGIN_MOD_SYM_KEY'
24010 | ___BEGIN_MOD_SYM_KEY
| ^~~~~~~~~~~~~~~~~~~~
_t-cpu-abstract-machine.c:589:24: warning: deprecated conversion from string constant to 'char*' [-Wwrite-strings]
589 | #define ___MODULE_NAME "_t-cpu-abstract-machine"
| ^~~~~~~~~~~~~~~~~~~~~~~~~
../include/gambit.h:9415:3: note: in expansion of macro '___MODULE_NAME'
9415 | ___MODULE_NAME, \
| ^~~~~~~~~~~~~~
_t-cpu-abstract-machine.c:24223:1: note: in expansion of macro '___BEGIN_MOD_SYM_KEY'
24223 | ___BEGIN_MOD_SYM_KEY
| ^~~~~~~~~~~~~~~~~~~~
g++ -O1 -fexpensive-optimizations -fno-gcse -pipe -O2 -msave-args -fno-aggressive-loop-optimizations -I/usr/include -I/opt/pkg/include/ncurses -I"../include" -c -o _t-cpu-backend-arm.o -I. -DHAVE_CONFIG_H _t-cpu-backend-arm.c -D___LIBRARY
_t-cpu-backend-arm.c:414:24: warning: deprecated conversion from string constant to 'char*' [-Wwrite-strings]
414 | #define ___MODULE_NAME "_t-cpu-backend-arm"
| ^~~~~~~~~~~~~~~~~~~~
../include/gambit.h:9415:3: note: in expansion of macro '___MODULE_NAME'
9415 | ___MODULE_NAME, \
| ^~~~~~~~~~~~~~
_t-cpu-backend-arm.c:14701:1: note: in expansion of macro '___BEGIN_MOD_SYM_KEY'
14701 | ___BEGIN_MOD_SYM_KEY
| ^~~~~~~~~~~~~~~~~~~~
g++ -O1 -fexpensive-optimizations -fno-gcse -pipe -O2 -msave-args -fno-aggressive-loop-optimizations -I/usr/include -I/opt/pkg/include/ncurses -I"../include" -c -o _t-cpu-backend-riscv.o -I. -DHAVE_CONFIG_H _t-cpu-backend-riscv.c -D___LIBRARY
g++ -O1 -fexpensive-optimizations -fno-gcse -pipe -O2 -msave-args -fno-aggressive-loop-optimizations -I/usr/include -I/opt/pkg/include/ncurses -I"../include" -c -o _arm.o -I. -DHAVE_CONFIG_H _arm.c -D___LIBRARY
_t-cpu-backend-riscv.c:441:24: warning: deprecated conversion from string constant to 'char*' [-Wwrite-strings]
441 | #define ___MODULE_NAME "_t-cpu-backend-riscv"
| ^~~~~~~~~~~~~~~~~~~~~~
../include/gambit.h:9415:3: note: in expansion of macro '___MODULE_NAME'
9415 | ___MODULE_NAME, \
| ^~~~~~~~~~~~~~
_t-cpu-backend-riscv.c:13453:1: note: in expansion of macro '___BEGIN_MOD_SYM_KEY'
13453 | ___BEGIN_MOD_SYM_KEY
| ^~~~~~~~~~~~~~~~~~~~
_arm.c:249:24: warning: deprecated conversion from string constant to 'char*' [-Wwrite-strings]
249 | #define ___MODULE_NAME "_arm"
| ^~~~~~
../include/gambit.h:9415:3: note: in expansion of macro '___MODULE_NAME'
9415 | ___MODULE_NAME, \
| ^~~~~~~~~~~~~~
_arm.c:13318:1: note: in expansion of macro '___BEGIN_MOD_SYM_KEY'
13318 | ___BEGIN_MOD_SYM_KEY
| ^~~~~~~~~~~~~~~~~~~~
g++ -O1 -fexpensive-optimizations -fno-gcse -pipe -O2 -msave-args -fno-aggressive-loop-optimizations -I/usr/include -I/opt/pkg/include/ncurses -I"../include" -c -o _source.o -I. -DHAVE_CONFIG_H _source.c -D___LIBRARY
g++ -O1 -fexpensive-optimizations -fno-gcse -pipe -O2 -msave-args -fno-aggressive-loop-optimizations -I/usr/include -I/opt/pkg/include/ncurses -I"../include" -c -o _t-cpu-primitives.o -I. -DHAVE_CONFIG_H _t-cpu-primitives.c -D___LIBRARY
g++: internal compiler error: Cpu Limit Exceeded signal terminated program cc1plus
Please submit a full bug report, with preprocessed source (by using -freport-bug).
See for instructions.
gmake[3]: *** [makefile:302: _std.o] Error 4
gmake[3]: Leaving directory '/tmp/work/lang/gambc/work/gambit-v4_9_8/lib'
_t-cpu-primitives.c:168:24: warning: deprecated conversion from string constant to 'char*' [-Wwrite-strings]
168 | #define ___MODULE_NAME "_t-cpu-primitives"
| ^~~~~~~~~~~~~~~~~~~
../include/gambit.h:9415:3: note: in expansion of macro '___MODULE_NAME'
9415 | ___MODULE_NAME, \
| ^~~~~~~~~~~~~~
_t-cpu-primitives.c:8264:1: note: in expansion of macro '___BEGIN_MOD_SYM_KEY'
8264 | ___BEGIN_MOD_SYM_KEY
| ^~~~~~~~~~~~~~~~~~~~
gmake[2]: *** [makefile:135: lib-phase3] Error 1
g++ -O1 -fexpensive-optimizations -fno-gcse -pipe -O2 -msave-args -fno-aggressive-loop-optimizations -I/usr/include -I/opt/pkg/include/ncurses -I"../include" -c -o _riscv.o -I. -DHAVE_CONFIG_H _riscv.c -D___LIBRARY
gmake[2]: *** Waiting for unfinished jobs....
_source.c:509:24: warning: deprecated conversion from string constant to 'char*' [-Wwrite-strings]
509 | #define ___MODULE_NAME "_source"
| ^~~~~~~~~
../include/gambit.h:9415:3: note: in expansion of macro '___MODULE_NAME'
9415 | ___MODULE_NAME, \
| ^~~~~~~~~~~~~~
_source.c:13816:1: note: in expansion of macro '___BEGIN_MOD_SYM_KEY'
13816 | ___BEGIN_MOD_SYM_KEY
| ^~~~~~~~~~~~~~~~~~~~
_riscv.c:316:24: warning: deprecated conversion from string constant to 'char*' [-Wwrite-strings]
316 | #define ___MODULE_NAME "_riscv"
| ^~~~~~~~
../include/gambit.h:9415:3: note: in expansion of macro '___MODULE_NAME'
9415 | ___MODULE_NAME, \
| ^~~~~~~~~~~~~~
_riscv.c:11526:1: note: in expansion of macro '___BEGIN_MOD_SYM_KEY'
11526 | ___BEGIN_MOD_SYM_KEY
| ^~~~~~~~~~~~~~~~~~~~
g++ -O1 -fexpensive-optimizations -fno-gcse -pipe -O2 -msave-args -fno-aggressive-loop-optimizations -I/usr/include -I/opt/pkg/include/ncurses -I"../include" -c -o _utils.o -I. -DHAVE_CONFIG_H _utils.c -D___LIBRARY
_utils.c:230:24: warning: deprecated conversion from string constant to 'char*' [-Wwrite-strings]
230 | #define ___MODULE_NAME "_utils"
| ^~~~~~~~
../include/gambit.h:9415:3: note: in expansion of macro '___MODULE_NAME'
9415 | ___MODULE_NAME, \
| ^~~~~~~~~~~~~~
_utils.c:9238:1: note: in expansion of macro '___BEGIN_MOD_SYM_KEY'
9238 | ___BEGIN_MOD_SYM_KEY
| ^~~~~~~~~~~~~~~~~~~~
g++ -O1 -fexpensive-optimizations -fno-gcse -pipe -O2 -msave-args -fno-aggressive-loop-optimizations -I/usr/include -I/opt/pkg/include/ncurses -I"../include" -c -o _asm.o -I. -DHAVE_CONFIG_H _asm.c -D___LIBRARY
g++ -O1 -fexpensive-optimizations -fno-gcse -pipe -O2 -msave-args -fno-aggressive-loop-optimizations -I/usr/include -I/opt/pkg/include/ncurses -I"../include" -c -o _gsclib.o -I. -DHAVE_CONFIG_H _gsclib.c -D___LIBRARY
_asm.c:216:24: warning: deprecated conversion from string constant to 'char*' [-Wwrite-strings]
216 | #define ___MODULE_NAME "_asm"
| ^~~~~~
../include/gambit.h:9415:3: note: in expansion of macro '___MODULE_NAME'
9415 | ___MODULE_NAME, \
| ^~~~~~~~~~~~~~
_asm.c:8334:1: note: in expansion of macro '___BEGIN_MOD_SYM_KEY'
8334 | ___BEGIN_MOD_SYM_KEY
| ^~~~~~~~~~~~~~~~~~~~
_gsclib.c:162:24: warning: deprecated conversion from string constant to 'char*' [-Wwrite-strings]
162 | #define ___MODULE_NAME "_gsclib"
| ^~~~~~~~~
../include/gambit.h:9415:3: note: in expansion of macro '___MODULE_NAME'
9415 | ___MODULE_NAME, \
| ^~~~~~~~~~~~~~
_gsclib.c:5505:1: note: in expansion of macro '___BEGIN_MOD_SYM_KEY'
5505 | ___BEGIN_MOD_SYM_KEY
| ^~~~~~~~~~~~~~~~~~~~
g++ -O1 -fexpensive-optimizations -fno-gcse -pipe -O2 -msave-args -fno-aggressive-loop-optimizations -I/usr/include -I/opt/pkg/include/ncurses -I"../include" -c -o _parms.o -I. -DHAVE_CONFIG_H _parms.c -D___LIBRARY
g++ -O1 -fexpensive-optimizations -fno-gcse -pipe -O2 -msave-args -fno-aggressive-loop-optimizations -I/usr/include -I/opt/pkg/include/ncurses -I"../include" -c -o _t-c-3.o -I. -DHAVE_CONFIG_H _t-c-3.c -D___LIBRARY
g++ -O1 -fexpensive-optimizations -fno-gcse -pipe -O2 -msave-args -fno-aggressive-loop-optimizations -I/usr/include -I/opt/pkg/include/ncurses -I"../include" -c -o _codegen.o -I. -DHAVE_CONFIG_H _codegen.c -D___LIBRARY
_codegen.c:163:24: warning: deprecated conversion from string constant to 'char*' [-Wwrite-strings]
163 | #define ___MODULE_NAME "_codegen"
| ^~~~~~~~~~
../include/gambit.h:9415:3: note: in expansion of macro '___MODULE_NAME'
9415 | ___MODULE_NAME, \
| ^~~~~~~~~~~~~~
_codegen.c:4484:1: note: in expansion of macro '___BEGIN_MOD_SYM_KEY'
4484 | ___BEGIN_MOD_SYM_KEY
| ^~~~~~~~~~~~~~~~~~~~
_parms.c:225:24: warning: deprecated conversion from string constant to 'char*' [-Wwrite-strings]
225 | #define ___MODULE_NAME "_parms"
| ^~~~~~~~
../include/gambit.h:9415:3: note: in expansion of macro '___MODULE_NAME'
9415 | ___MODULE_NAME, \
| ^~~~~~~~~~~~~~
_parms.c:5463:1: note: in expansion of macro '___BEGIN_MOD_SYM_KEY'
5463 | ___BEGIN_MOD_SYM_KEY
| ^~~~~~~~~~~~~~~~~~~~
_t-c-3.c:235:24: warning: deprecated conversion from string constant to 'char*' [-Wwrite-strings]
235 | #define ___MODULE_NAME "_t-c-3"
| ^~~~~~~~
../include/gambit.h:9415:3: note: in expansion of macro '___MODULE_NAME'
9415 | ___MODULE_NAME, \
| ^~~~~~~~~~~~~~
_t-c-3.c:9307:1: note: in expansion of macro '___BEGIN_MOD_SYM_KEY'
9307 | ___BEGIN_MOD_SYM_KEY
| ^~~~~~~~~~~~~~~~~~~~
g++ -O1 -fexpensive-optimizations -fno-gcse -pipe -O2 -msave-args -fno-aggressive-loop-optimizations -I/usr/include -I/opt/pkg/include/ncurses -I"../include" -c -o _back.o -I. -DHAVE_CONFIG_H _back.c -D___LIBRARY
g++ -O1 -fexpensive-optimizations -fno-gcse -pipe -O2 -msave-args -fno-aggressive-loop-optimizations -I/usr/include -I/opt/pkg/include/ncurses -I"../include" -c -o _env.o -I. -DHAVE_CONFIG_H _env.c -D___LIBRARY
_back.c:249:24: warning: deprecated conversion from string constant to 'char*' [-Wwrite-strings]
249 | #define ___MODULE_NAME "_back"
| ^~~~~~~
../include/gambit.h:9415:3: note: in expansion of macro '___MODULE_NAME'
9415 | ___MODULE_NAME, \
| ^~~~~~~~~~~~~~
_back.c:4990:1: note: in expansion of macro '___BEGIN_MOD_SYM_KEY'
4990 | ___BEGIN_MOD_SYM_KEY
| ^~~~~~~~~~~~~~~~~~~~
_env.c:189:24: warning: deprecated conversion from string constant to 'char*' [-Wwrite-strings]
189 | #define ___MODULE_NAME "_env"
| ^~~~~~
../include/gambit.h:9415:3: note: in expansion of macro '___MODULE_NAME'
9415 | ___MODULE_NAME, \
| ^~~~~~~~~~~~~~
_env.c:4513:1: note: in expansion of macro '___BEGIN_MOD_SYM_KEY'
4513 | ___BEGIN_MOD_SYM_KEY
| ^~~~~~~~~~~~~~~~~~~~
g++ -O1 -fexpensive-optimizations -fno-gcse -pipe -O2 -msave-args -fno-aggressive-loop-optimizations -I/usr/include -I/opt/pkg/include/ncurses -I"../include" -c -o _host.o -I. -DHAVE_CONFIG_H _host.c -D___LIBRARY
_host.c:420:24: warning: deprecated conversion from string constant to 'char*' [-Wwrite-strings]
420 | #define ___MODULE_NAME "_host"
| ^~~~~~~
../include/gambit.h:9415:3: note: in expansion of macro '___MODULE_NAME'
9415 | ___MODULE_NAME, \
| ^~~~~~~~~~~~~~
_host.c:5937:1: note: in expansion of macro '___BEGIN_MOD_SYM_KEY'
5937 | ___BEGIN_MOD_SYM_KEY
| ^~~~~~~~~~~~~~~~~~~~
g++ -O1 -fexpensive-optimizations -fno-gcse -pipe -O2 -msave-args -fno-aggressive-loop-optimizations -I/usr/include -I/opt/pkg/include/ncurses -I"../include" -c -o _t-cpu-object-desc.o -I. -DHAVE_CONFIG_H _t-cpu-object-desc.c -D___LIBRARY
_t-cpu-object-desc.c:213:24: warning: deprecated conversion from string constant to 'char*' [-Wwrite-strings]
213 | #define ___MODULE_NAME "_t-cpu-object-desc"
| ^~~~~~~~~~~~~~~~~~~~
../include/gambit.h:9415:3: note: in expansion of macro '___MODULE_NAME'
9415 | ___MODULE_NAME, \
| ^~~~~~~~~~~~~~
_t-cpu-object-desc.c:3455:1: note: in expansion of macro '___BEGIN_MOD_SYM_KEY'
3455 | ___BEGIN_MOD_SYM_KEY
| ^~~~~~~~~~~~~~~~~~~~
g++ -O1 -fexpensive-optimizations -fno-gcse -pipe -O2 -msave-args -fno-aggressive-loop-optimizations -I/usr/include -I/opt/pkg/include/ncurses -I"../include" -c -o _t-cpu.o -I. -DHAVE_CONFIG_H _t-cpu.c -D___LIBRARY
g++ -O1 -fexpensive-optimizations -fno-gcse -pipe -O2 -msave-args -fno-aggressive-loop-optimizations -I/usr/include -I/opt/pkg/include/ncurses -I"../include" -c -o _t-cpu-utils.o -I. -DHAVE_CONFIG_H _t-cpu-utils.c -D___LIBRARY
_t-cpu.c:101:24: warning: deprecated conversion from string constant to 'char*' [-Wwrite-strings]
101 | #define ___MODULE_NAME "_t-cpu"
| ^~~~~~~~
../include/gambit.h:9415:3: note: in expansion of macro '___MODULE_NAME'
9415 | ___MODULE_NAME, \
| ^~~~~~~~~~~~~~
_t-cpu.c:1476:1: note: in expansion of macro '___BEGIN_MOD_SYM_KEY'
1476 | ___BEGIN_MOD_SYM_KEY
| ^~~~~~~~~~~~~~~~~~~~
_t-cpu-utils.c:41:24: warning: deprecated conversion from string constant to 'char*' [-Wwrite-strings]
41 | #define ___MODULE_NAME "_t-cpu-utils"
| ^~~~~~~~~~~~~~
../include/gambit.h:9415:3: note: in expansion of macro '___MODULE_NAME'
9415 | ___MODULE_NAME, \
| ^~~~~~~~~~~~~~
_t-cpu-utils.c:533:1: note: in expansion of macro '___BEGIN_MOD_SYM_KEY'
533 | ___BEGIN_MOD_SYM_KEY
| ^~~~~~~~~~~~~~~~~~~~
g++ -O1 -fexpensive-optimizations -fno-gcse -pipe -O2 -msave-args -fno-aggressive-loop-optimizations -I/usr/include -I/opt/pkg/include/ncurses -I"../include" -c -o _assert.o -I. -DHAVE_CONFIG_H _assert.c -D___LIBRARY
_assert.c:28:24: warning: deprecated conversion from string constant to 'char*' [-Wwrite-strings]
28 | #define ___MODULE_NAME "_assert"
| ^~~~~~~~~
../include/gambit.h:9415:3: note: in expansion of macro '___MODULE_NAME'
9415 | ___MODULE_NAME, \
| ^~~~~~~~~~~~~~
_assert.c:140:1: note: in expansion of macro '___BEGIN_MOD_SYM_KEY'
140 | ___BEGIN_MOD_SYM_KEY
| ^~~~~~~~~~~~~~~~~~~~
g++ -O1 -fexpensive-optimizations -fno-gcse -pipe -O2 -msave-args -fno-aggressive-loop-optimizations -I/usr/include -I/opt/pkg/include/ncurses -I"../include" -c -o _gambitgsc.o -I. -DHAVE_CONFIG_H _gambitgsc.c -D___LIBRARY
_gambitgsc.c:18954:26: warning: deprecated conversion from string constant to 'char*' [-Wwrite-strings]
18954 | #define ___LINKFILE_NAME "_gambitgsc"
| ^~~~~~~~~~~~
../include/gambit.h:9541:3: note: in expansion of macro '___LINKFILE_NAME'
9541 | ___LINKFILE_NAME, \
| ^~~~~~~~~~~~~~~~
../include/gambit.h:8893:44: note: in expansion of macro '___LINKFILE_DESCR'
8893 | #define ___END_NEW_SYM_GLO(prevsym,prevkey)___LINKFILE_DESCR(prevsym,prevkey)
| ^~~~~~~~~~~~~~~~~
_gambitgsc.c:48128:1: note: in expansion of macro '___END_NEW_SYM_GLO'
48128 | ___END_NEW_SYM_GLO(___S_xmm9,___K_warnings_3f_)
| ^~~~~~~~~~~~~~~~~~
_gvm.c:612:24: warning: deprecated conversion from string constant to 'char*' [-Wwrite-strings]
612 | #define ___MODULE_NAME "_gvm"
| ^~~~~~
../include/gambit.h:9415:3: note: in expansion of macro '___MODULE_NAME'
9415 | ___MODULE_NAME, \
| ^~~~~~~~~~~~~~
_gvm.c:28583:1: note: in expansion of macro '___BEGIN_MOD_SYM_KEY'
28583 | ___BEGIN_MOD_SYM_KEY
| ^~~~~~~~~~~~~~~~~~~~
gmake[4]: Leaving directory '/tmp/work/lang/gambc/work/gambit-v4_9_8/gsc'
gmake[3]: Leaving directory '/tmp/work/lang/gambc/work/gambit-v4_9_8/gsc'
gmake[2]: Leaving directory '/tmp/work/lang/gambc/work/gambit-v4_9_8'
*** making phase4
gmake[2]: Entering directory '/tmp/work/lang/gambc/work/gambit-v4_9_8'
making phase4 in lib
making phase4 in bin
making phase4 in include
making phase4 in gsi
gmake[3]: Entering directory '/tmp/work/lang/gambc/work/gambit-v4_9_8/include'
gmake[3]: Nothing to be done for 'phase4'.
gmake[3]: Leaving directory '/tmp/work/lang/gambc/work/gambit-v4_9_8/include'
gmake[3]: Entering directory '/tmp/work/lang/gambc/work/gambit-v4_9_8/bin'
gmake[3]: Nothing to be done for 'phase4'.
gmake[3]: Leaving directory '/tmp/work/lang/gambc/work/gambit-v4_9_8/bin'
gmake[3]: Entering directory '/tmp/work/lang/gambc/work/gambit-v4_9_8/gsi'
rm -f "libgambitgsi.so" "libgambitgsi.so" "libgambitgsi.so"
g++ -O1 -fexpensive-optimizations -fno-gcse -pipe -O2 -msave-args -fno-aggressive-loop-optimizations -I/usr/include -I/opt/pkg/include/ncurses -I"../include" -c -o _gsi.o -I. -DHAVE_CONFIG_H _gsi.c
gmake[3]: Entering directory '/tmp/work/lang/gambc/work/gambit-v4_9_8/lib'
gmake[3]: Nothing to be done for 'phase4'.
gmake[3]: Leaving directory '/tmp/work/lang/gambc/work/gambit-v4_9_8/lib'
g++ -O1 -fexpensive-optimizations -fno-gcse -pipe -O2 -msave-args -fno-aggressive-loop-optimizations -I/usr/include -I/opt/pkg/include/ncurses -I"../include" -c -o _gsi_.o -I. -DHAVE_CONFIG_H _gsi_.c
gmake[3]: *** No rule to make target '../lib/libgambit.so', needed by 'gsi'. Stop.
gmake[3]: *** Waiting for unfinished jobs....
g++ -L/usr/lib/amd64 -Wl,-R/usr/lib/amd64 -L/opt/pkg/lib -Wl,-R/opt/pkg/lib -pipe -O2 -msave-args -fno-aggressive-loop-optimizations -I/usr/include -I/opt/pkg/include/ncurses -shared -Wl,-soname,libgambitgsi.so -o libgambitgsi.so _gsilib.o _gambitgsi.o ../lib/libgambit.so -lresolv -lnsl -lsocket -lm
making phase4 in gsc
gmake[3]: Entering directory '/tmp/work/lang/gambc/work/gambit-v4_9_8/gsc'
rm -f "libgambitgsc.so" "libgambitgsc.so" "libgambitgsc.so"
ld: fatal: file ../lib/libgambit.so: open failed: No such file or directory
g++ -L/usr/lib/amd64 -Wl,-R/usr/lib/amd64 -L/opt/pkg/lib -Wl,-R/opt/pkg/lib -pipe -O2 -msave-args -fno-aggressive-loop-optimizations -I/usr/include -I/opt/pkg/include/ncurses -shared -Wl,-soname,libgambitgsc.so -o libgambitgsc.so _host.o _utils.o _source.o _parms.o _env.o _ptree1.o _ptree2.o _gvm.o _back.o _front.o _prims.o _assert.o _asm.o _x86.o _arm.o _riscv.o _codegen.o _t-univ-1.o _t-univ-2.o _t-univ-3.o _t-univ-4.o _t-cpu-abstract-machine.o _t-cpu-primitives.o _t-cpu-object-desc.o _t-cpu-utils.o _t-cpu-backend-x86.o _t-cpu-backend-arm.o _t-cpu-backend-riscv.o _t-cpu.o _t-c-1.o _t-c-2.o _t-c-3.o _gsclib.o _gambitgsc.o ../lib/libgambit.so -lresolv -lnsl -lsocket -lm
ld: fatal: file processing errors. No output written to libgambitgsi.so
collect2: error: ld returned 1 exit status
gmake[3]: *** [makefile:197: libgambitgsi.so] Error 1
g++ -O1 -fexpensive-optimizations -fno-gcse -pipe -O2 -msave-args -fno-aggressive-loop-optimizations -I/usr/include -I/opt/pkg/include/ncurses -I"../include" -c -o _gsc.o -I. -DHAVE_CONFIG_H _gsc.c
ld: fatal: file ../lib/libgambit.so: open failed: No such file or directory
ld: fatal: file processing errors. No output written to libgambitgsc.so
collect2: error: ld returned 1 exit status
gmake[3]: *** [makefile:283: libgambitgsc.so] Error 1
gmake[3]: *** Waiting for unfinished jobs....
_gsi_.c:10841:26: warning: deprecated conversion from string constant to 'char*' [-Wwrite-strings]
10841 | #define ___LINKFILE_NAME "_gsi_"
| ^~~~~~~
../include/gambit.h:9541:3: note: in expansion of macro '___LINKFILE_NAME'
9541 | ___LINKFILE_NAME, \
| ^~~~~~~~~~~~~~~~
../include/gambit.h:8893:44: note: in expansion of macro '___LINKFILE_DESCR'
8893 | #define ___END_NEW_SYM_GLO(prevsym,prevkey)___LINKFILE_DESCR(prevsym,prevkey)
| ^~~~~~~~~~~~~~~~~
_gsi_.c:17122:1: note: in expansion of macro '___END_NEW_SYM_GLO'
17122 | ___END_NEW_SYM_GLO(___S___gsi_23_,0)
| ^~~~~~~~~~~~~~~~~~
_gsi.c:174:24: warning: deprecated conversion from string constant to 'char*' [-Wwrite-strings]
174 | #define ___MODULE_NAME "_gsi"
| ^~~~~~
../include/gambit.h:9415:3: note: in expansion of macro '___MODULE_NAME'
9415 | ___MODULE_NAME, \
| ^~~~~~~~~~~~~~
_gsi.c:3464:1: note: in expansion of macro '___BEGIN_MOD_SYM_KEY'
3464 | ___BEGIN_MOD_SYM_KEY
| ^~~~~~~~~~~~~~~~~~~~
_gsc.c:262:24: warning: deprecated conversion from string constant to 'char*' [-Wwrite-strings]
262 | #define ___MODULE_NAME "_gsc"
| ^~~~~~
../include/gambit.h:9415:3: note: in expansion of macro '___MODULE_NAME'
9415 | ___MODULE_NAME, \
| ^~~~~~~~~~~~~~
_gsc.c:8145:1: note: in expansion of macro '___BEGIN_MOD_SYM_KEY'
8145 | ___BEGIN_MOD_SYM_KEY
| ^~~~~~~~~~~~~~~~~~~~
gmake[3]: Leaving directory '/tmp/work/lang/gambc/work/gambit-v4_9_8/gsi'
gmake[2]: *** [makefile:135: gsi-phase4] Error 1
gmake[2]: *** Waiting for unfinished jobs....
gmake[3]: Leaving directory '/tmp/work/lang/gambc/work/gambit-v4_9_8/gsc'
gmake[2]: *** [makefile:135: gsc-phase4] Error 1
gmake[2]: Leaving directory '/tmp/work/lang/gambc/work/gambit-v4_9_8'
gmake[1]: *** [makefile:121: phases] Error 2
gmake[1]: Leaving directory '/tmp/work/lang/gambc/work/gambit-v4_9_8'
gmake: *** [makefile:113: core-pre] Error 2
*** Error code 2
Stop.
bmake[1]: stopped making "all" in /data/jenkins/workspace/pkgsrc-upstream-trunk/lang/gambc
*** Error code 1
Stop.
bmake: stopped making "all" in /data/jenkins/workspace/pkgsrc-upstream-trunk/lang/gambc